PDA

View Full Version : [Mondrian] FW: Cron <jhyde@marmalade> nice sh --login/home/jhyde/open2/mondrian/testAll --nightly



Julian Hyde
01-16-2007, 02:00 PM
Richard,

Your recent checkin caused about 24 errors; more on JDK 1.4. Can you take a
look?

Summary is below, and the full logfile is attached.

The 1 failure is due to Bart's change 8481. You should ignore it. He and I
are still working on reproducing the issue in his environment.

Julian

---

Tests completed at Tue Jan 16 08:29:22 PST 2007.
Running test with JDK=jdk1.5 database=derby props={ mondrian.test.VUsers=1}
[java] FAILURES!!!
[java] Tests run: 1118, Failures: 1, Errors: 0
Running test with JDK=jdk1.4 database=mysql props={ mondrian.test.VUsers=1
mondrian.rolap.aggregates.Use=true mondrian.rolap.aggregates.Read=true}
[java] FAILURES!!!
[java] Tests run: 1118, Failures: 1, Errors: 39
Running test with JDK=jdk1.5 database=mysql props={ mondrian.test.VUsers=1
mondrian.rolap.aggregates.Use=true mondrian.rolap.aggregates.Read=true}
[java] OK (1118 tests)
Running test with JDK=jdk1.4 database=oracle props={ mondrian.test.VUsers=1}
[java] FAILURES!!!
[java] Tests run: 1118, Failures: 0, Errors: 39
Running test with JDK=jdk1.5 database=oracle props={ mondrian.test.VUsers=1}
[java] FAILURES!!!
[java] Tests run: 1118, Failures: 1, Errors: 0
Running test with JDK=jdk1.6 database=oracle props={ mondrian.test.VUsers=1}
[java] FAILURES!!!
[java] Tests run: 1118, Failures: 1, Errors: 0
Running test with JDK=jdk1.5 database=oracle props={
mondrian.test.ExpDependencies=10 mondrian.test.random.seed=-1
mondrian.expCache.enable=false}
[java] FAILURES!!!
[java] Tests run: 1118, Failures: 0, Errors: 24
Running test with JDK=jdk1.5 database=oracle props={
mondrian.rolap.aggregates.Use=true mondrian.rolap.aggregates.Read=true}
[java] FAILURES!!!
[java] Tests run: 1118, Failures: 1, Errors: 0
Running test with JDK=jdk1.5 database=oracle props={
mondrian.olap.case.sensitive=false}
[java] FAILURES!!!
[java] Tests run: 1118, Failures: 1, Errors: 0
Running test with JDK=jdk1.5 database=oracle props={
mondrian.test.ExpDependencies=10 mondrian.test.random.seed=-1
mondrian.expCache.enable=false}
[java] FAILURES!!!
[java] Tests run: 1118, Failures: 0, Errors: 24
Running test with JDK=jdk1.5 database=oracle props={
mondrian.test.ExpDependencies=100 mondrian.test.random.seed=15583
mondrian.expCache.enable=false}
[java] FAILURES!!!
[java] Tests run: 1118, Failures: 0, Errors: 24
Running test with JDK=jdk1.5 database=oracle props={
mondrian.expCache.enable=false}
[java] FAILURES!!!
[java] Tests run: 1118, Failures: 0, Errors: 27
Running test with JDK=jdk1.5 database=oracle props={
mondrian.rolap.aggregates.Use=true mondrian.rolap.aggregates.Read=true}
[java] FAILURES!!!
[java] Tests run: 1118, Failures: 1, Errors: 0
Running test with JDK=jdk1.5 database=oracle props={
mondrian.rolap.star.disableCaching=true}
[java] FAILURES!!!
[java] Tests run: 1118, Failures: 1, Errors: 0
Running test with JDK=jdk1.4 database=derby props={ mondrian.test.VUsers=1
mondrian.rolap.aggregates.Use=true mondrian.rolap.aggregates.Read=true}
[java] FAILURES!!!
[java] Tests run: 1118, Failures: 1, Errors: 39
Running test with JDK=jdk1.4 database=oracle props={ mondrian.test.VUsers=1
mondrian.rolap.aggregates.Use=true mondrian.rolap.aggregates.Read=true}
[java] FAILURES!!!
[java] Tests run: 1118, Failures: 0, Errors: 39
Running test with JDK=jdk1.4 database=mysql props={ mondrian.test.VUsers=1
mondrian.rolap.aggregates.Use=true mondrian.rolap.aggregates.Read=true}
[java] FAILURES!!!
[java] Tests run: 1118, Failures: 1, Errors: 39
Running test with JDK=jdk1.5 database=derby props={ mondrian.test.VUsers=1
mondrian.rolap.aggregates.Use=true mondrian.rolap.aggregates.Read=true}
[java] FAILURES!!!
[java] Tests run: 1118, Failures: 1, Errors: 0
Running test with JDK=jdk1.5 database=oracle props={ mondrian.test.VUsers=1
mondrian.rolap.aggregates.Use=true mondrian.rolap.aggregates.Read=true}
[java] FAILURES!!!
[java] Tests run: 1118, Failures: 1, Errors: 0
Running test with JDK=jdk1.5 database=mysql props={ mondrian.test.VUsers=1
mondrian.rolap.aggregates.Use=true mondrian.rolap.aggregates.Read=true}
[java] OK (1118 tests)
Running test with JDK=jdk1.6 database=derby props={ mondrian.test.VUsers=1
mondrian.rolap.aggregates.Use=true mondrian.rolap.aggregates.Read=true}
[java] FAILURES!!!
[java] Tests run: 1118, Failures: 1, Errors: 0
Running test with JDK=jdk1.6 database=oracle props={ mondrian.test.VUsers=1
mondrian.rolap.aggregates.Use=true mondrian.rolap.aggregates.Read=true}
[java] FAILURES!!!
[java] Tests run: 1118, Failures: 1, Errors: 0
Running test with JDK=jdk1.6 database=mysql props={ mondrian.test.VUsers=1
mondrian.rolap.aggregates.Use=true mondrian.rolap.aggregates.Read=true}
[java] OK (1118 tests)
Running test with JDK=jdk1.4 database=derby props={ mondrian.test.VUsers=1
mondrian.rolap.aggregates.Use=false mondrian.rolap.aggregates.Read=false}
[java] FAILURES!!!
[java] Tests run: 1118, Failures: 1, Errors: 39
Running test with JDK=jdk1.4 database=oracle props={ mondrian.test.VUsers=1
mondrian.rolap.aggregates.Use=false mondrian.rolap.aggregates.Read=false}
[java] FAILURES!!!
[java] Tests run: 1118, Failures: 0, Errors: 39
Running test with JDK=jdk1.4 database=mysql props={ mondrian.test.VUsers=1
mondrian.rolap.aggregates.Use=false mondrian.rolap.aggregates.Read=false}
[java] FAILURES!!!
[java] Tests run: 1118, Failures: 0, Errors: 39
Running test with JDK=jdk1.5 database=derby props={ mondrian.test.VUsers=1
mondrian.rolap.aggregates.Use=false mondrian.rolap.aggregates.Read=false}
[java] FAILURES!!!
[java] Tests run: 1118, Failures: 1, Errors: 0
Running test with JDK=jdk1.5 database=oracle props={ mondrian.test.VUsers=1
mondrian.rolap.aggregates.Use=false mondrian.rolap.aggregates.Read=false}
[java] FAILURES!!!
[java] Tests run: 1118, Failures: 1, Errors: 0
Running test with JDK=jdk1.5 database=mysql props={ mondrian.test.VUsers=1
mondrian.rolap.aggregates.Use=false mondrian.rolap.aggregates.Read=false}
[java] OK (1118 tests)
Running test with JDK=jdk1.6 database=derby props={ mondrian.test.VUsers=1
mondrian.rolap.aggregates.Use=false mondrian.rolap.aggregates.Read=false}
[java] FAILURES!!!
[java] Tests run: 1118, Failures: 1, Errors: 0
Running test with JDK=jdk1.6 database=oracle props={ mondrian.test.VUsers=1
mondrian.rolap.aggregates.Use=false mondrian.rolap.aggregates.Read=false}
[java] FAILURES!!!
[java] Tests run: 1118, Failures: 1, Errors: 0
Running test with JDK=jdk1.6 database=mysql props={ mondrian.test.VUsers=1
mondrian.rolap.aggregates.Use=false mondrian.rolap.aggregates.Read=false}
[java] OK (1118 tests)

_______________________________________________
Mondrian mailing list
Mondrian (AT) pentaho (DOT) org
http://lists.pentaho.org/mailman/listinfo/mondrian