PDA

View Full Version : [Mondrian] FW: Cron <jhyde@marmalade> nice sh --login/home/jhyde/open2/mondrian/testAll --nightly



Julian Hyde
03-22-2007, 03:21 PM
This is the healthiest the regression suite has been for a long while! 1
failure in a select few configurations.

Thanks to Richard for fixing the long-standing virtual cube issue.

Richard, note that there are some javadoc errors (bottom of this email).

Julian


-----Original Message-----
From: Cron Daemon [mailto:root (AT) marmalade (DOT) hydromatic.net]
Sent: Thursday, March 22, 2007 2:00 AM
To: julianhyde (AT) gmail (DOT) com
Subject: Cron <jhyde@marmalade> nice sh --login
/home/jhyde/open2/mondrian/testAll --nightly


::: Summary :::::::::::::::::::::::::::::::::::::
Tests completed at Thu Mar 22 09:32:19 PDT 2007.
Running test with JDK=jdk1.5 database=derby props={
mondrian.test.VUsers=1}
[java] OK (1262 tests)
Running test with JDK=jdk1.4 database=mysql props={
mondrian.test.VUsers=1 mondrian.rolap.aggregates.Use=true
mondrian.rolap.aggregates.Read=true}
[java] OK (1262 tests)
Running test with JDK=jdk1.5 database=mysql props={
mondrian.test.VUsers=1 mondrian.rolap.aggregates.Use=true
mondrian.rolap.aggregates.Read=true}
[java] OK (1262 tests)
Running test with JDK=jdk1.4 database=oracle props={
mondrian.test.VUsers=1}
[java] OK (1262 tests)
Running test with JDK=jdk1.5 database=oracle props={
mondrian.test.VUsers=1}
[java] OK (1262 tests)
Running test with JDK=jdk1.6 database=oracle props={
mondrian.test.VUsers=1}
[java] OK (1262 tests)
Running test with JDK=jdk1.5 database=oracle props={
mondrian.test.ExpDependencies=10 mondrian.test.random.seed=-1
mondrian.expCache.enable=false}
[java] OK (1262 tests)
Running test with JDK=jdk1.5 database=oracle props={
mondrian.rolap.aggregates.Use=true mondrian.rolap.aggregates.Read=true}
[java] OK (1262 tests)
Running test with JDK=jdk1.5 database=oracle props={
mondrian.olap.case.sensitive=false}
[java] OK (1262 tests)
Running test with JDK=jdk1.5 database=derby props={
mondrian.rolap.star.disableCaching=true
mondrian.rolap.star.disableCaching=true
mondrian.xmla.drillthroughTotalCount.enable=false}
[java] FAILURES!!!
[java] Tests run: 1262, Failures: 1, Errors: 0
Running test with JDK=jdk1.5 database=oracle props={
mondrian.test.ExpDependencies=10 mondrian.test.random.seed=-1
mondrian.expCache.enable=false}
[java] OK (1262 tests)
Running test with JDK=jdk1.5 database=oracle props={
mondrian.test.ExpDependencies=100 mondrian.test.random.seed=15583
mondrian.expCache.enable=false}
[java] OK (1262 tests)
Running test with JDK=jdk1.5 database=oracle props={
mondrian.expCache.enable=false}
[java] OK (1262 tests)
Running test with JDK=jdk1.5 database=oracle props={
mondrian.rolap.aggregates.Use=true mondrian.rolap.aggregates.Read=true}
[java] OK (1262 tests)
Running test with JDK=jdk1.5 database=oracle props={
mondrian.rolap.star.disableCaching=true}
[java] OK (1262 tests)
Running test with JDK=jdk1.5 database=oracle props={
mondrian.olap.case.sensitive=false}
[java] OK (1262 tests)
Running test with JDK=jdk1.4 database=derby props={
mondrian.test.VUsers=1 mondrian.rolap.aggregates.Use=true
mondrian.rolap.aggregates.Read=true}
[java] FAILURES!!!
[java] Tests run: 1262, Failures: 1, Errors: 0
Running test with JDK=jdk1.4 database=oracle props={
mondrian.test.VUsers=1 mondrian.rolap.aggregates.Use=true
mondrian.rolap.aggregates.Read=true}
[java] OK (1262 tests)
Running test with JDK=jdk1.4 database=mysql props={
mondrian.test.VUsers=1 mondrian.rolap.aggregates.Use=true
mondrian.rolap.aggregates.Read=true}
[java] OK (1262 tests)
Running test with JDK=jdk1.5 database=derby props={
mondrian.test.VUsers=1 mondrian.rolap.aggregates.Use=true
mondrian.rolap.aggregates.Read=true}
[java] OK (1262 tests)
Running test with JDK=jdk1.5 database=oracle props={
mondrian.test.VUsers=1 mondrian.rolap.aggregates.Use=true
mondrian.rolap.aggregates.Read=true}
[java] OK (1262 tests)
Running test with JDK=jdk1.5 database=mysql props={
mondrian.test.VUsers=1 mondrian.rolap.aggregates.Use=true
mondrian.rolap.aggregates.Read=true}
[java] OK (1262 tests)
Running test with JDK=jdk1.6 database=derby props={
mondrian.test.VUsers=1 mondrian.rolap.aggregates.Use=true
mondrian.rolap.aggregates.Read=true}
[java] OK (1262 tests)
Running test with JDK=jdk1.6 database=oracle props={
mondrian.test.VUsers=1 mondrian.rolap.aggregates.Use=true
mondrian.rolap.aggregates.Read=true}
[java] OK (1262 tests)
Running test with JDK=jdk1.6 database=mysql props={
mondrian.test.VUsers=1 mondrian.rolap.aggregates.Use=true
mondrian.rolap.aggregates.Read=true}
[java] OK (1262 tests)
Running test with JDK=jdk1.4 database=derby props={
mondrian.test.VUsers=1 mondrian.rolap.aggregates.Use=false
mondrian.rolap.aggregates.Read=false}
[java] FAILURES!!!
[java] Tests run: 1262, Failures: 1, Errors: 0
Running test with JDK=jdk1.4 database=oracle props={
mondrian.test.VUsers=1 mondrian.rolap.aggregates.Use=false
mondrian.rolap.aggregates.Read=false}
[java] OK (1262 tests)
Running test with JDK=jdk1.4 database=mysql props={
mondrian.test.VUsers=1 mondrian.rolap.aggregates.Use=false
mondrian.rolap.aggregates.Read=false}
[java] OK (1262 tests)
Running test with JDK=jdk1.5 database=derby props={
mondrian.test.VUsers=1 mondrian.rolap.aggregates.Use=false
mondrian.rolap.aggregates.Read=false}
[java] OK (1262 tests)
Running test with JDK=jdk1.5 database=oracle props={
mondrian.test.VUsers=1 mondrian.rolap.aggregates.Use=false
mondrian.rolap.aggregates.Read=false}
[java] OK (1262 tests)
Running test with JDK=jdk1.5 database=mysql props={
mondrian.test.VUsers=1 mondrian.rolap.aggregates.Use=false
mondrian.rolap.aggregates.Read=false}
[java] OK (1262 tests)
Running test with JDK=jdk1.6 database=derby props={
mondrian.test.VUsers=1 mondrian.rolap.aggregates.Use=false
mondrian.rolap.aggregates.Read=false}
[java] OK (1262 tests)
Running test with JDK=jdk1.6 database=oracle props={
mondrian.test.VUsers=1 mondrian.rolap.aggregates.Use=false
mondrian.rolap.aggregates.Read=false}
[java] OK (1262 tests)
Running test with JDK=jdk1.6 database=mysql props={
mondrian.test.VUsers=1 mondrian.rolap.aggregates.Use=false
mondrian.rolap.aggregates.Read=false}
[java] OK (1262 tests)
[java] FAILURES!!!
[java] Tests run: 1262, Failures: 1, Errors: 0
[java] FAILURES!!!
[java] Tests run: 1262, Failures: 1, Errors: 0
[java] FAILURES!!!
[java] Tests run: 1262, Failures: 1, Errors: 0
There were failures.

::: check javadoc :::::::::::::::::::::::::::::::
[javadoc]
/home/jhyde/open2/mondrian/src/main/mondrian/rolap/agg/AggregationManage
r.java:380: warning - Tag @link: reference not found: PinSet
[javadoc]
/home/jhyde/open2/mondrian/src/main/mondrian/rolap/agg/AggregationManage
r.java:380: warning - Tag @link: reference not found: PinSet
[javadoc]
/home/jhyde/open2/mondrian/src/main/mondrian/rolap/agg/AggregationManage
r.java:380: warning - Tag @link: reference not found: PinSet
[javadoc]
/home/jhyde/open2/mondrian/src/main/mondrian/rolap/agg/AggregationManage
r.java:380: warning - Tag @link: reference not found: PinSet


Julian

_______________________________________________
Mondrian mailing list
Mondrian (AT) pentaho (DOT) org
http://lists.pentaho.org/mailman/listinfo/mondrian