Hi,

I am trying to run an oem sample and here is the page: https://github.com/tmorgner/pentaho-...ample-use-full

Under the "Building the samples" section, it says:

Building the samples
--------------------

After resolving, invoke "ant dist" to compile the samples.

I followed the instructions and executing "ant dist" in the terminal (in Mac) gave me this:

compile.compile:
[javac] /Users/neil/Desktop/Neil/Pentaho/pentaho-reporting-oem-sdk/sample-use-full/build-res/subfloor.xml:1160: warning: 'includeantruntime' was not set, defaulting to build.sysclasspath=last; set to false for repeatable builds
[javac] Compiling 3 source files to /Users/neil/Desktop/Neil/Pentaho/pentaho-reporting-oem-sdk/sample-use-full/bin/classes
[javac] warning: [path] bad path element "/Users/neil/Desktop/Neil/Pentaho/pentaho-reporting-oem-sdk/sample-use-full/lib/internal/xbean.jar": no such file or directory
[javac] warning: [path] bad path element "/Users/neil/Desktop/Neil/Pentaho/pentaho-reporting-oem-sdk/sample-use-full/lib/internal/avalon-framework-4.2.0.jar": no such file or directory
[javac] warning: [path] bad path element "/Users/neil/Desktop/Neil/Pentaho/pentaho-reporting-oem-sdk/sample-use-full/lib/internal/batik-all-1.6.jar": no such file or directory
[javac] warning: [path] bad path element "/Users/neil/Desktop/Neil/Pentaho/pentaho-reporting-oem-sdk/sample-use-full/lib/internal/commons-io-1.3.1.jar": no such file or directory
[javac] warning: [path] bad path element "/Users/neil/Desktop/Neil/Pentaho/pentaho-reporting-oem-sdk/sample-use-full/lib/internal/commons-logging-1.0.4.jar": no such file or directory
[javac] warning: [path] bad path element "/Users/neil/Desktop/Neil/Pentaho/pentaho-reporting-oem-sdk/sample-use-full/lib/internal/fop-hyph.jar": no such file or directory
[javac] warning: [path] bad path element "/Users/neil/Desktop/Neil/Pentaho/pentaho-reporting-oem-sdk/sample-use-full/lib/internal/jai_codec.jar": no such file or directory
[javac] warning: [path] bad path element "/Users/neil/Desktop/Neil/Pentaho/pentaho-reporting-oem-sdk/sample-use-full/lib/internal/jai_core.jar": no such file or directory
[javac] warning: [path] bad path element "/Users/neil/Desktop/Neil/Pentaho/pentaho-reporting-oem-sdk/sample-use-full/lib/internal/jimi.jar": no such file or directory
[javac] warning: [path] bad path element "/Users/neil/Desktop/Neil/Pentaho/pentaho-reporting-oem-sdk/sample-use-full/lib/internal/serializer-2.7.0.jar": no such file or directory
[javac] warning: [path] bad path element "/Users/neil/Desktop/Neil/Pentaho/pentaho-reporting-oem-sdk/sample-use-full/lib/internal/servlet-2.2.jar": no such file or directory
[javac] warning: [path] bad path element "/Users/neil/Desktop/Neil/Pentaho/pentaho-reporting-oem-sdk/sample-use-full/lib/internal/xercesImpl.jar": no such file or directory
[javac] warning: [path] bad path element "/Users/neil/Desktop/Neil/Pentaho/pentaho-reporting-oem-sdk/sample-use-full/lib/internal/xml-apis.jar": no such file or directory
[javac] warning: [path] bad path element "/Users/neil/Desktop/Neil/Pentaho/pentaho-reporting-oem-sdk/sample-use-full/lib/internal/serializer.jar": no such file or directory
[javac] warning: [path] bad path element "/Users/neil/Desktop/Neil/Pentaho/pentaho-reporting-oem-sdk/sample-use-full/lib/internal/xercesImpl-2.7.1.jar": no such file or directory
[javac] warning: [path] bad path element "/Users/neil/Desktop/Neil/Pentaho/pentaho-reporting-oem-sdk/sample-use-full/lib/internal/xml-apis-1.3.02.jar": no such file or directory
[javac] warning: [path] bad path element "/Users/neil/Desktop/Neil/Pentaho/pentaho-reporting-oem-sdk/sample-use-full/lib/internal/xmlunit1.0.jar": no such file or directory
[javac] warning: [options] bootstrap class path not set in conjunction with -source 1.7
[javac] /Users/neil/Desktop/Neil/Pentaho/pentaho-reporting-oem-sdk/sample-use-full/src/sdk/sample/UseReportingExport.java:10: error: package org.pentaho.reporting.libraries.resourceloader does not exist
[javac] import org.pentaho.reporting.libraries.resourceloader.ResourceException;
[javac] ^
[javac] /Users/neil/Desktop/Neil/Pentaho/pentaho-reporting-oem-sdk/sample-use-full/src/sdk/sample/UseReportingExport.java:11: error: package org.pentaho.reporting.libraries.resourceloader does not exist
[javac] import org.pentaho.reporting.libraries.resourceloader.ResourceManager;
[javac] ^
[javac] /Users/neil/Desktop/Neil/Pentaho/pentaho-reporting-oem-sdk/sample-use-full/src/sdk/sample/UseReportingGui.java:10: error: package org.pentaho.reporting.libraries.designtime.swing does not exist
[javac] import org.pentaho.reporting.libraries.designtime.swing.LibSwingUtil;
[javac] ^
[javac] /Users/neil/Desktop/Neil/Pentaho/pentaho-reporting-oem-sdk/sample-use-full/src/sdk/sample/UseReportingGui.java:11: error: package org.pentaho.reporting.libraries.resourceloader does not exist
[javac] import org.pentaho.reporting.libraries.resourceloader.ResourceException;
[javac] ^
[javac] /Users/neil/Desktop/Neil/Pentaho/pentaho-reporting-oem-sdk/sample-use-full/src/sdk/sample/UseReportingExport.java:19: error: cannot access AbstractBoot
[javac] ClassicEngineBoot.getInstance().start();
[javac] ^
[javac] class file for org.pentaho.reporting.libraries.base.boot.AbstractBoot not found
[javac] /Users/neil/Desktop/Neil/Pentaho/pentaho-reporting-oem-sdk/sample-use-full/src/sdk/sample/UseReportingExport.java:23: error: cannot find symbol
[javac] final ResourceManager mgr = new ResourceManager();
[javac] ^
[javac] symbol: class ResourceManager
[javac] location: class UseReportingExport
[javac] /Users/neil/Desktop/Neil/Pentaho/pentaho-reporting-oem-sdk/sample-use-full/src/sdk/sample/UseReportingExport.java:23: error: cannot find symbol
[javac] final ResourceManager mgr = new ResourceManager();
[javac] ^
[javac] symbol: class ResourceManager
[javac] location: class UseReportingExport
[javac] /Users/neil/Desktop/Neil/Pentaho/pentaho-reporting-oem-sdk/sample-use-full/src/sdk/sample/UseReportingExport.java:24: warning: [cast] redundant cast to getResource
[javac] final MasterReport report = (MasterReport) mgr.createDirectly(url, MasterReport.class).getResource();
[javac] ^
[javac] /Users/neil/Desktop/Neil/Pentaho/pentaho-reporting-oem-sdk/sample-use-full/src/sdk/sample/UseReportingExport.java:29: error: cannot find symbol
[javac] catch (ResourceException e)
[javac] ^
[javac] symbol: class ResourceException
[javac] location: class UseReportingExport
[javac] /Users/neil/Desktop/Neil/Pentaho/pentaho-reporting-oem-sdk/sample-use-full/src/sdk/sample/UseReportingGui.java:23: error: cannot find symbol
[javac] ClassicEngineBoot.getInstance().start();
[javac] ^
[javac] symbol: method start()
[javac] location: class ClassicEngineBoot
[javac] /Users/neil/Desktop/Neil/Pentaho/pentaho-reporting-oem-sdk/sample-use-full/src/sdk/sample/UseReportingGui.java:30: error: cannot find symbol
[javac] final ResourceManager mgr = new ResourceManager();
[javac] ^
[javac] symbol: class ResourceManager
[javac] location: class UseReportingGui
[javac] /Users/neil/Desktop/Neil/Pentaho/pentaho-reporting-oem-sdk/sample-use-full/src/sdk/sample/UseReportingGui.java:30: error: cannot find symbol
[javac] final ResourceManager mgr = new ResourceManager();
[javac] ^
[javac] symbol: class ResourceManager
[javac] location: class UseReportingGui
[javac] /Users/neil/Desktop/Neil/Pentaho/pentaho-reporting-oem-sdk/sample-use-full/src/sdk/sample/UseReportingGui.java:33: warning: [cast] redundant cast to getResource
[javac] final MasterReport report = (MasterReport) mgr.createDirectly(url, MasterReport.class).getResource();
[javac] ^
[javac] /Users/neil/Desktop/Neil/Pentaho/pentaho-reporting-oem-sdk/sample-use-full/src/sdk/sample/UseReportingGui.java:45: error: cannot find symbol
[javac] LibSwingUtil.centerFrameOnScreen(d);
[javac] ^
[javac] symbol: variable LibSwingUtil
[javac] /Users/neil/Desktop/Neil/Pentaho/pentaho-reporting-oem-sdk/sample-use-full/src/sdk/sample/UseReportingGui.java:52: error: cannot find symbol
[javac] catch (ResourceException e)
[javac] ^
[javac] symbol: class ResourceException
[javac] location: class UseReportingGui
[javac] 13 errors
[javac] 20 warnings


BUILD FAILED
/Users/neil/Desktop/Neil/Pentaho/pentaho-reporting-oem-sdk/sample-use-full/build-res/subfloor.xml:1160: Compile failed; see the compiler error output for details.

I am not sure what I missed.

Please advise,

Neil